Information card for entry 4346409
Formula | C79 H46 Dy2 F14 N4 O10 |
Calculated formula | C79 H46 Dy2 F14 N4 O10 |
Title of publication | Ligand Field Affected Single-Molecule Magnet Behavior of Lanthanide(III) Dinuclear Complexes with an 8-Hydroxyquinoline Schiff Base Derivative as Bridging Ligand. |
Authors of publication | Wang, Wen-Min; Zhang, Hong-Xia; Wang, Shi-Yu; Shen, Hai-Yun; Gao, Hong-Ling; Cui, Jian-Zhong; Zhao, Bin |
Journal of publication | Inorganic chemistry |
Year of publication | 2015 |
Journal volume | 54 |
Journal issue | 22 |
Pages of publication | 10610 - 10622 |
a | 11.034 ± 0.002 Å |
b | 13.209 ± 0.003 Å |
c | 14.584 ± 0.003 Å |
α | 68.82 ± 0.03° |
β | 86.43 ± 0.03° |
γ | 76.58 ± 0.03° |
Cell volume | 1927.3 ± 0.8 Å3 |
Cell temperature | 113 ± 2 K |
Ambient diffraction temperature | 113 ± 2 K |
Number of distinct elements | 6 |
Space group number | 2 |
Hermann-Mauguin space group symbol | P -1 |
Hall space group symbol | -P 1 |
Residual factor for all reflections | 0.0493 |
Residual factor for significantly intense reflections | 0.0467 |
Weighted residual factors for significantly intense reflections | 0.1522 |
Weighted residual factors for all reflections included in the refinement | 0.1574 |
Goodness-of-fit parameter for all reflections included in the refinement | 1.109 |
Diffraction radiation wavelength | 0.71073 Å |
Diffraction radiation type | MoKα |