Information card for entry 4346433
Formula | C28 H26 F6 Fe N6 O6 S2 |
Calculated formula | C28 H26 F6 Fe N6 O6 S2 |
SMILES | [Fe]1234([n]5ccccc5C=[N]1Cc1[n]2ccc(c1)C)[n]1ccccc1C[N]3=Cc1[n]4ccc(c1)C.S(=O)(=O)(C(F)(F)F)[O-].S(=O)(=O)(C(F)(F)F)[O-] |
Title of publication | C-H Bond Oxidation Catalyzed by an Imine-Based Iron Complex: A Mechanistic Insight. |
Authors of publication | Olivo, Giorgio; Nardi, Martina; Vìdal, Diego; Barbieri, Alessia; Lapi, Andrea; Gómez, Laura; Lanzalunga, Osvaldo; Costas, Miquel; Di Stefano, Stefano |
Journal of publication | Inorganic chemistry |
Year of publication | 2015 |
Journal volume | 54 |
Journal issue | 21 |
Pages of publication | 10141 - 10152 |
a | 12.332 ± 0.008 Å |
b | 14.479 ± 0.008 Å |
c | 20.801 ± 0.011 Å |
α | 90° |
β | 93.797 ± 0.013° |
γ | 90° |
Cell volume | 3706 ± 4 Å3 |
Cell temperature | 173 ± 2 K |
Ambient diffraction temperature | 173 ± 2 K |
Number of distinct elements | 7 |
Space group number | 14 |
Hermann-Mauguin space group symbol | P 1 21/c 1 |
Hall space group symbol | -P 2ybc |
Residual factor for all reflections | 0.1813 |
Residual factor for significantly intense reflections | 0.0782 |
Weighted residual factors for significantly intense reflections | 0.2131 |
Weighted residual factors for all reflections included in the refinement | 0.3008 |
Goodness-of-fit parameter for all reflections included in the refinement | 1.006 |
Diffraction radiation wavelength | 0.71073 Å |
Diffraction radiation type | MoKα |