Information card for entry 4346436
Formula | C26 H34 Ru2 S2 |
Calculated formula | C26 H34 Ru2 S2 |
SMILES | [Ru]12345678([Ru]9%10%11%12%13([S]1[c]17[c]8([S]29)cccc1)[c]1([c]%10([c]%11([c]%12([c]%131C)C)C)C)C)[c]1([c]6([c]5([c]4([c]31C)C)C)C)C |
Title of publication | Synthesis and Electrocatalytic Property of Diiron Hydride Complexes Derived from a Thiolate-Bridged Diiron Complex. |
Authors of publication | Yang, Dawei; Li, Yang; Wang, Baomin; Zhao, Xiangyu; Su, Linan; Chen, Si; Tong, Peng; Luo, Yi; Qu, Jingping |
Journal of publication | Inorganic chemistry |
Year of publication | 2015 |
Journal volume | 54 |
Journal issue | 21 |
Pages of publication | 10243 - 10249 |
a | 10.9904 ± 0.0007 Å |
b | 15.3232 ± 0.001 Å |
c | 16.1802 ± 0.001 Å |
α | 85.717 ± 0.004° |
β | 80.189 ± 0.004° |
γ | 69.812 ± 0.004° |
Cell volume | 2519.7 ± 0.3 Å3 |
Cell temperature | 298 ± 2 K |
Ambient diffraction temperature | 298 ± 2 K |
Number of distinct elements | 4 |
Space group number | 2 |
Hermann-Mauguin space group symbol | P -1 |
Hall space group symbol | -P 1 |
Residual factor for all reflections | 0.0752 |
Residual factor for significantly intense reflections | 0.0611 |
Weighted residual factors for significantly intense reflections | 0.1835 |
Weighted residual factors for all reflections included in the refinement | 0.192 |
Goodness-of-fit parameter for all reflections included in the refinement | 1 |
Diffraction radiation wavelength | 0.71073 Å |
Diffraction radiation type | MoKα |