Information card for entry 4346440
Formula | C147 H143 B2 F48 Mo4 O5 P4 |
Calculated formula | C147 H143 B2 F48 Mo4 O5 P4 |
Title of publication | Electronic Structure and Multisite Basicity of the Pyramidal Phosphinidene-Bridged Dimolybdenum Complex [Mo2(η(5)-C5H5)(μ-κ(1):κ(1),η(5)-PC5H4)(η(6)-C6H3(t)Bu3)(CO)2(PMe3)]. |
Authors of publication | Albuerne, Isabel G.; Alvarez, M. Angeles; García, M Esther; García-Vivó, Daniel; Ruiz, Miguel A. |
Journal of publication | Inorganic chemistry |
Year of publication | 2015 |
Journal volume | 54 |
Journal issue | 20 |
Pages of publication | 9810 - 9820 |
a | 13.0024 ± 0.0003 Å |
b | 15.9819 ± 0.0004 Å |
c | 18.5868 ± 0.0005 Å |
α | 80.395 ± 0.002° |
β | 86.049 ± 0.002° |
γ | 80.743 ± 0.002° |
Cell volume | 3755.14 ± 0.17 Å3 |
Cell temperature | 150 ± 2 K |
Ambient diffraction temperature | 150 ± 2 K |
Number of distinct elements | 7 |
Space group number | 2 |
Hermann-Mauguin space group symbol | P -1 |
Hall space group symbol | -P 1 |
Residual factor for all reflections | 0.0633 |
Residual factor for significantly intense reflections | 0.0537 |
Weighted residual factors for significantly intense reflections | 0.1403 |
Weighted residual factors for all reflections included in the refinement | 0.1493 |
Goodness-of-fit parameter for all reflections included in the refinement | 1.028 |
Diffraction radiation probe | x-ray |
Diffraction radiation wavelength | 1.54184 Å |
Diffraction radiation type | CuKα |