Information card for entry 4346495
Formula | C62 H45 La N10 O6 |
Calculated formula | C62 H45 La N10 O6 |
Title of publication | Influence of symmetry on the luminescence and radiative lifetime of nine-coordinate europium complexes. |
Authors of publication | Shavaleev, Nail M.; Eliseeva, Svetlana V.; Scopelliti, Rosario; Bünzli, Jean-Claude G |
Journal of publication | Inorganic chemistry |
Year of publication | 2015 |
Journal volume | 54 |
Journal issue | 18 |
Pages of publication | 9166 - 9173 |
a | 14.53 ± 0.003 Å |
b | 15.0592 ± 0.0014 Å |
c | 29.683 ± 0.006 Å |
α | 79.403 ± 0.01° |
β | 79.779 ± 0.016° |
γ | 64.729 ± 0.01° |
Cell volume | 5737.3 ± 1.8 Å3 |
Cell temperature | 100 ± 2 K |
Ambient diffraction temperature | 100 ± 2 K |
Number of distinct elements | 5 |
Space group number | 2 |
Hermann-Mauguin space group symbol | P -1 |
Hall space group symbol | -P 1 |
Residual factor for all reflections | 0.0738 |
Residual factor for significantly intense reflections | 0.0591 |
Weighted residual factors for significantly intense reflections | 0.1151 |
Weighted residual factors for all reflections included in the refinement | 0.1194 |
Goodness-of-fit parameter for all reflections included in the refinement | 1.274 |
Diffraction radiation wavelength | 0.71073 Å |
Diffraction radiation type | MoKα |