Information card for entry 4346500
Common name | polymeric_DyCu2 |
Chemical name | {[{Cu(salpn)}2Dy(NO3)3bpy](MeOH)(H2O)}n |
Formula | C45 H46 Cu2 Dy N9 O15 |
Calculated formula | C45 H44 Cu2 Dy N9 O15 |
Title of publication | Strong ferromagnetic exchange interactions in hinge-like Dy(O2Cu)2 complexes involving double oxygen bridges. |
Authors of publication | Ida, Yumi; Ghosh, Soumavo; Ghosh, Ashutosh; Nojiri, Hiroyuki; Ishida, Takayuki |
Journal of publication | Inorganic chemistry |
Year of publication | 2015 |
Journal volume | 54 |
Journal issue | 19 |
Pages of publication | 9543 - 9555 |
a | 15.334 ± 0.006 Å |
b | 25.95 ± 0.01 Å |
c | 15.975 ± 0.009 Å |
α | 90° |
β | 113.08 ± 0.004° |
γ | 90° |
Cell volume | 5848 ± 5 Å3 |
Cell temperature | 293 ± 2 K |
Ambient diffraction temperature | 293 ± 2 K |
Number of distinct elements | 6 |
Space group number | 15 |
Hermann-Mauguin space group symbol | C 1 2/c 1 |
Hall space group symbol | -C 2yc |
Residual factor for all reflections | 0.1089 |
Residual factor for significantly intense reflections | 0.0758 |
Weighted residual factors for significantly intense reflections | 0.2059 |
Weighted residual factors for all reflections included in the refinement | 0.2336 |
Goodness-of-fit parameter for all reflections included in the refinement | 1.064 |
Diffraction radiation wavelength | 0.71073 Å |
Diffraction radiation type | MoKα |