Information card for entry 4346502
Common name | transoid_DyCu2 |
Chemical name | [{(Cu(salpn))Me(CO)Me}2Dy(NO3)3] |
Formula | C40 H44 Cu2 Dy N7 O15 |
Calculated formula | C40 H44 Cu2 Dy N7 O15 |
Title of publication | Strong ferromagnetic exchange interactions in hinge-like Dy(O2Cu)2 complexes involving double oxygen bridges. |
Authors of publication | Ida, Yumi; Ghosh, Soumavo; Ghosh, Ashutosh; Nojiri, Hiroyuki; Ishida, Takayuki |
Journal of publication | Inorganic chemistry |
Year of publication | 2015 |
Journal volume | 54 |
Journal issue | 19 |
Pages of publication | 9543 - 9555 |
a | 17.583 ± 0.005 Å |
b | 17.583 ± 0.005 Å |
c | 29.716 ± 0.005 Å |
α | 90 ± 0.005° |
β | 90 ± 0.005° |
γ | 90 ± 0.005° |
Cell volume | 9187 ± 4 Å3 |
Cell temperature | 293 ± 2 K |
Ambient diffraction temperature | 293 ± 2 K |
Number of distinct elements | 6 |
Space group number | 88 |
Hermann-Mauguin space group symbol | I 41/a :2 |
Hall space group symbol | -I 4ad |
Residual factor for all reflections | 0.0438 |
Residual factor for significantly intense reflections | 0.0347 |
Weighted residual factors for significantly intense reflections | 0.0824 |
Weighted residual factors for all reflections included in the refinement | 0.089 |
Goodness-of-fit parameter for all reflections included in the refinement | 1.058 |
Diffraction radiation wavelength | 0.71073 Å |
Diffraction radiation type | MoKα |