Information card for entry 4346507
Formula | C38 H98 I N7 Na4 Si6 |
Calculated formula | C38 H98 I N7 Na4 Si6 |
SMILES | [Na]12([I]34[Na]([N]1([Si](C)(C)C)[Si](C)(C)C)[N]([Na]3[N]([Na]14[N]([C@H]3[C@H]([N]1(C)C)CCCC3)(C)C)([Si](C)(C)C)[Si](C)(C)C)([Si](C)(C)C)[Si](C)(C)C)[N]([C@H]1[C@H]([N]2(C)C)CCCC1)(C)C |
Title of publication | Synthetic and Structural Studies of Mixed Sodium Bis(trimethylsilyl)amide/Sodium Halide Aggregates in the Presence of η(2)-N,N-, η(3)-N,N,N/N,O,N-, and η(4)-N,N,N,N-Donor Ligands. |
Authors of publication | Ojeda-Amador, Ana I; Martínez-Martínez, Antonio J; Kennedy, Alan R.; O'Hara, Charles T |
Journal of publication | Inorganic chemistry |
Year of publication | 2015 |
Journal volume | 54 |
Journal issue | 20 |
Pages of publication | 9833 - 9844 |
a | 13.3519 ± 0.0003 Å |
b | 15.3554 ± 0.0005 Å |
c | 15.3294 ± 0.0004 Å |
α | 90° |
β | 105.646 ± 0.002° |
γ | 90° |
Cell volume | 3026.44 ± 0.15 Å3 |
Cell temperature | 123 ± 2 K |
Ambient diffraction temperature | 123 ± 2 K |
Number of distinct elements | 6 |
Space group number | 4 |
Hermann-Mauguin space group symbol | P 1 21 1 |
Hall space group symbol | P 2yb |
Residual factor for all reflections | 0.0564 |
Residual factor for significantly intense reflections | 0.0462 |
Weighted residual factors for significantly intense reflections | 0.1106 |
Weighted residual factors for all reflections included in the refinement | 0.1174 |
Goodness-of-fit parameter for all reflections included in the refinement | 1.029 |
Diffraction radiation wavelength | 1.54184 Å |
Diffraction radiation type | CuKα |