Information card for entry 4346509
Formula | C30 H86 Br N7 Na4 Si6 |
Calculated formula | C30 H86 Br N7 Na4 Si6 |
SMILES | [Br]123[Na]4([N](C)(CC[N]4(C)C)C)[N]([Na]1[N]([Na]2[N]([Na]13[N](CC[N]1(C)C)(C)C)([Si](C)(C)C)[Si](C)(C)C)([Si](C)(C)C)[Si](C)(C)C)([Si](C)(C)C)[Si](C)(C)C |
Title of publication | Synthetic and Structural Studies of Mixed Sodium Bis(trimethylsilyl)amide/Sodium Halide Aggregates in the Presence of η(2)-N,N-, η(3)-N,N,N/N,O,N-, and η(4)-N,N,N,N-Donor Ligands. |
Authors of publication | Ojeda-Amador, Ana I; Martínez-Martínez, Antonio J; Kennedy, Alan R.; O'Hara, Charles T |
Journal of publication | Inorganic chemistry |
Year of publication | 2015 |
Journal volume | 54 |
Journal issue | 20 |
Pages of publication | 9833 - 9844 |
a | 9.0031 ± 0.0002 Å |
b | 14.6586 ± 0.0002 Å |
c | 20.7632 ± 0.0003 Å |
α | 90° |
β | 93.652 ± 0.002° |
γ | 90° |
Cell volume | 2734.61 ± 0.08 Å3 |
Cell temperature | 123 ± 2 K |
Ambient diffraction temperature | 123 ± 2 K |
Number of distinct elements | 6 |
Space group number | 7 |
Hermann-Mauguin space group symbol | P 1 n 1 |
Hall space group symbol | P -2yac |
Residual factor for all reflections | 0.0597 |
Residual factor for significantly intense reflections | 0.0509 |
Weighted residual factors for significantly intense reflections | 0.1296 |
Weighted residual factors for all reflections included in the refinement | 0.1418 |
Goodness-of-fit parameter for all reflections included in the refinement | 1.072 |
Diffraction radiation wavelength | 1.54184 Å |
Diffraction radiation type | CuKα |