Information card for entry 4346523
Common name | 2_FeVL |
Formula | C42.5 H64 Fe N4 P3 V |
Calculated formula | C42.5 H64 Fe N4 P3 V |
Title of publication | Heterobimetallic Complexes That Bond Vanadium to Iron, Cobalt, and Nickel. |
Authors of publication | Clouston, Laura J.; Bernales, Varinia; Cammarota, Ryan C.; Carlson, Rebecca K.; Bill, Eckhard; Gagliardi, Laura; Lu, Connie C. |
Journal of publication | Inorganic chemistry |
Year of publication | 2015 |
Journal volume | 54 |
Journal issue | 24 |
Pages of publication | 11669 - 11679 |
a | 11.2034 ± 0.0004 Å |
b | 14.1739 ± 0.0006 Å |
c | 14.3424 ± 0.0006 Å |
α | 70.92° |
β | 80.58° |
γ | 82.81° |
Cell volume | 2117.09 ± 0.15 Å3 |
Cell temperature | 173 ± 2 K |
Ambient diffraction temperature | 173 ± 2 K |
Number of distinct elements | 6 |
Space group number | 2 |
Hermann-Mauguin space group symbol | P -1 |
Hall space group symbol | -P 1 |
Residual factor for all reflections | 0.0526 |
Residual factor for significantly intense reflections | 0.0359 |
Weighted residual factors for significantly intense reflections | 0.0791 |
Weighted residual factors for all reflections included in the refinement | 0.0892 |
Goodness-of-fit parameter for all reflections included in the refinement | 1.013 |
Diffraction radiation wavelength | 0.71073 Å |
Diffraction radiation type | MoKα |