Information card for entry 4346525
Common name | 3_CoVL |
Formula | C42.5 H64 Co N4 P3 V |
Calculated formula | C42.5 H64 Co N4 P3 V |
Title of publication | Heterobimetallic Complexes That Bond Vanadium to Iron, Cobalt, and Nickel. |
Authors of publication | Clouston, Laura J.; Bernales, Varinia; Cammarota, Ryan C.; Carlson, Rebecca K.; Bill, Eckhard; Gagliardi, Laura; Lu, Connie C. |
Journal of publication | Inorganic chemistry |
Year of publication | 2015 |
Journal volume | 54 |
Journal issue | 24 |
Pages of publication | 11669 - 11679 |
a | 11.1828 ± 0.0006 Å |
b | 14.1917 ± 0.0007 Å |
c | 14.3156 ± 0.0007 Å |
α | 70.779 ± 0.001° |
β | 80.653 ± 0.001° |
γ | 82.74 ± 0.001° |
Cell volume | 2110.31 ± 0.19 Å3 |
Cell temperature | 173 ± 2 K |
Ambient diffraction temperature | 173 ± 2 K |
Number of distinct elements | 6 |
Space group number | 2 |
Hermann-Mauguin space group symbol | P -1 |
Hall space group symbol | -P 1 |
Residual factor for all reflections | 0.0579 |
Residual factor for significantly intense reflections | 0.0377 |
Weighted residual factors for significantly intense reflections | 0.0818 |
Weighted residual factors for all reflections included in the refinement | 0.0927 |
Goodness-of-fit parameter for all reflections included in the refinement | 1.024 |
Diffraction radiation wavelength | 0.71073 Å |
Diffraction radiation type | MoKα |