Information card for entry 4346536
Formula | C37 H35 Cl F6 N P3 Pt |
Calculated formula | C37 H35 Cl F6 N P3 Pt |
Title of publication | Chiral Platinum(II) Complexes Featuring Phosphine and Chloroquine Ligands as Cytotoxic and Monofunctional DNA-Binding Agents. |
Authors of publication | Villarreal, Wilmer; Colina-Vegas, Legna; Rodrigues de Oliveira, Clayton; Tenorio, Juan C.; Ellena, Javier; Gozzo, Fábio C; Cominetti, Marcia Regina; Ferreira, Antonio G.; Ferreira, Marco Antonio Barbosa; Navarro, Maribel; Batista, Alzir A. |
Journal of publication | Inorganic chemistry |
Year of publication | 2015 |
Journal volume | 54 |
Journal issue | 24 |
Pages of publication | 11709 - 11720 |
a | 16.787 ± 0.0002 Å |
b | 13.55 ± 0.0002 Å |
c | 16.965 ± 0.0003 Å |
α | 90° |
β | 111.802 ± 0.001° |
γ | 90° |
Cell volume | 3582.91 ± 0.1 Å3 |
Cell temperature | 100 ± 2 K |
Ambient diffraction temperature | 100 ± 2 K |
Number of distinct elements | 7 |
Space group number | 14 |
Hermann-Mauguin space group symbol | P 1 21/a 1 |
Hall space group symbol | -P 2yab |
Residual factor for all reflections | 0.0623 |
Residual factor for significantly intense reflections | 0.049 |
Weighted residual factors for significantly intense reflections | 0.1345 |
Weighted residual factors for all reflections included in the refinement | 0.1426 |
Goodness-of-fit parameter for all reflections included in the refinement | 1.099 |
Diffraction radiation probe | x-ray |
Diffraction radiation wavelength | 0.71073 Å |
Diffraction radiation type | MoKα |