Information card for entry 4346538
Formula | C24 H20 Co N10 O2 |
Calculated formula | C24 H20 Co N10 O2 |
Title of publication | Single-ion-magnet behavior in a two-dimensional coordination polymer constructed from Co(II) nodes and a pyridylhydrazone derivative. |
Authors of publication | Liu, Xiangyu; Sun, Lin; Zhou, Huiliang; Cen, Peipei; Jin, Xiaoyong; Xie, Gang; Chen, Sanping; Hu, Qilin |
Journal of publication | Inorganic chemistry |
Year of publication | 2015 |
Journal volume | 54 |
Journal issue | 18 |
Pages of publication | 8884 - 8886 |
a | 11.662 ± 0.003 Å |
b | 11.82 ± 0.003 Å |
c | 16.928 ± 0.005 Å |
α | 90° |
β | 90° |
γ | 90° |
Cell volume | 2333.4 ± 1.1 Å3 |
Cell temperature | 296 ± 2 K |
Ambient diffraction temperature | 296.15 K |
Number of distinct elements | 5 |
Space group number | 61 |
Hermann-Mauguin space group symbol | P b c a |
Hall space group symbol | -P 2ac 2ab |
Residual factor for all reflections | 0.0667 |
Residual factor for significantly intense reflections | 0.037 |
Weighted residual factors for significantly intense reflections | 0.0866 |
Weighted residual factors for all reflections included in the refinement | 0.1007 |
Goodness-of-fit parameter for all reflections included in the refinement | 1.014 |
Diffraction radiation wavelength | 0.71073 Å |
Diffraction radiation type | MoKα |