Information card for entry 4346540
Formula | C18 H28 Mn N10 |
Calculated formula | C18 H28 Mn N10 |
Title of publication | Role of Temperature and Pressure on the Multisensitive Multiferroic Dicyanamide Framework [TPrA][Mn(dca)3] with Perovskite-like Structure. |
Authors of publication | Bermúdez-García, Juan M; Sánchez-Andújar, Manuel; Yáñez-Vilar, Susana; Castro-García, Socorro; Artiaga, Ramón; López-Beceiro, Jorge; Botana, Luis; Alegría, Ángel; Señarís-Rodríguez, María A |
Journal of publication | Inorganic chemistry |
Year of publication | 2015 |
Journal volume | 54 |
Journal issue | 24 |
Pages of publication | 11680 - 11687 |
a | 11.5684 ± 0.0003 Å |
b | 11.5684 ± 0.0003 Å |
c | 17.65 ± 0.0005 Å |
α | 90° |
β | 90° |
γ | 90° |
Cell volume | 2362.06 ± 0.11 Å3 |
Cell temperature | 368 ± 2 K |
Ambient diffraction temperature | 368 ± 2 K |
Number of distinct elements | 4 |
Space group number | 140 |
Hermann-Mauguin space group symbol | I 4/m c m |
Hall space group symbol | -I 4 2c |
Residual factor for all reflections | 0.074 |
Residual factor for significantly intense reflections | 0.0653 |
Weighted residual factors for significantly intense reflections | 0.1585 |
Weighted residual factors for all reflections included in the refinement | 0.1774 |
Goodness-of-fit parameter for all reflections included in the refinement | 1.097 |
Diffraction radiation wavelength | 0.71073 Å |
Diffraction radiation type | MoKα |