Information card for entry 4346561
Formula | C15 H10 Br N4 O5 Re |
Calculated formula | C15 H10 Br N4 O5 Re |
SMILES | c1(ccc(cc1)N(=O)=O)C=[N]1Nc2cccc[n]2[Re]1(C#[O])(C#[O])(C#[O])Br |
Title of publication | Toward hypoxia-selective rhenium and technetium tricarbonyl complexes. |
Authors of publication | North, Andrea J.; Hayne, David J.; Schieber, Christine; Price, Katherine; White, Anthony R.; Crouch, Peter J.; Rigopoulos, Angela; O'Keefe, Graeme J; Tochon-Danguy, Henri; Scott, Andrew M.; White, Jonathan M.; Ackermann, Uwe; Donnelly, Paul S. |
Journal of publication | Inorganic chemistry |
Year of publication | 2015 |
Journal volume | 54 |
Journal issue | 19 |
Pages of publication | 9594 - 9610 |
a | 7.0457 ± 0.0004 Å |
b | 7.2712 ± 0.0005 Å |
c | 16.6373 ± 0.0006 Å |
α | 77.386 ± 0.005° |
β | 88.36 ± 0.005° |
γ | 86.942 ± 0.005° |
Cell volume | 830.46 ± 0.08 Å3 |
Cell temperature | 130 ± 0.2 K |
Ambient diffraction temperature | 130 ± 0.2 K |
Number of distinct elements | 6 |
Space group number | 2 |
Hermann-Mauguin space group symbol | P -1 |
Hall space group symbol | -P 1 |
Residual factor for all reflections | 0.0525 |
Residual factor for significantly intense reflections | 0.0418 |
Weighted residual factors for significantly intense reflections | 0.1018 |
Weighted residual factors for all reflections included in the refinement | 0.1075 |
Goodness-of-fit parameter for all reflections included in the refinement | 1.121 |
Diffraction radiation wavelength | 1.5418 Å |
Diffraction radiation type | CuKα |