Information card for entry 4346587
Formula | C30 H24 Cl4 N8 Ni2 |
Calculated formula | C30 H24 Cl4 N8 Ni2 |
Title of publication | Homoleptic transition metal complexes of the 7-azaindolide ligand featuring κ(1)-N1 coordination. |
Authors of publication | Przyojski, Jacob A.; Kiewit, Monica L.; Fillman, Kathlyn L.; Arman, Hadi D.; Tonzetich, Zachary J. |
Journal of publication | Inorganic chemistry |
Year of publication | 2015 |
Journal volume | 54 |
Journal issue | 19 |
Pages of publication | 9637 - 9645 |
a | 8.695 ± 0.004 Å |
b | 9.374 ± 0.005 Å |
c | 10.121 ± 0.006 Å |
α | 87.28 ± 0.03° |
β | 88.25 ± 0.02° |
γ | 69.923 ± 0.017° |
Cell volume | 773.8 ± 0.7 Å3 |
Cell temperature | 98 ± 2 K |
Ambient diffraction temperature | 98 ± 2 K |
Number of distinct elements | 5 |
Space group number | 2 |
Hermann-Mauguin space group symbol | P -1 |
Hall space group symbol | -P 1 |
Residual factor for all reflections | 0.0765 |
Residual factor for significantly intense reflections | 0.0698 |
Weighted residual factors for significantly intense reflections | 0.1484 |
Weighted residual factors for all reflections included in the refinement | 0.1524 |
Goodness-of-fit parameter for all reflections included in the refinement | 1.015 |
Diffraction radiation wavelength | 0.71073 Å |
Diffraction radiation type | MoKα |