Information card for entry 4346620
Formula | C18 H18 Cl N2 Ti |
Calculated formula | C18 H18 Cl N2 Ti |
Title of publication | Electronic Structure and Reactivity of a Well-Defined Mononuclear Complex of Ti(II). |
Authors of publication | Wijeratne, Gayan B.; Zolnhofer, Eva M.; Fortier, Skye; Grant, Lauren N.; Carroll, Patrick J.; Chen, Chun-Hsing; Meyer, Karsten; Krzystek, J.; Ozarowski, Andrew; Jackson, Timothy A.; Mindiola, Daniel J.; Telser, Joshua |
Journal of publication | Inorganic chemistry |
Year of publication | 2015 |
Journal volume | 54 |
Journal issue | 21 |
Pages of publication | 10380 - 10397 |
a | 13.5081 ± 0.0009 Å |
b | 7.1545 ± 0.0004 Å |
c | 18.0442 ± 0.0012 Å |
α | 90° |
β | 109.918 ± 0.004° |
γ | 90° |
Cell volume | 1639.54 ± 0.18 Å3 |
Cell temperature | 150 ± 2 K |
Ambient diffraction temperature | 150 ± 2 K |
Number of distinct elements | 5 |
Space group number | 14 |
Hermann-Mauguin space group symbol | P 1 21/c 1 |
Hall space group symbol | -P 2ybc |
Residual factor for all reflections | 0.0395 |
Residual factor for significantly intense reflections | 0.0286 |
Weighted residual factors for significantly intense reflections | 0.0692 |
Weighted residual factors for all reflections included in the refinement | 0.0737 |
Goodness-of-fit parameter for all reflections included in the refinement | 1.033 |
Diffraction radiation wavelength | 0.71073 Å |
Diffraction radiation type | MoKα |