Information card for entry 4346628
Formula | C15 H30 Fe N3 S6 |
Calculated formula | C15 H30 Fe N3 S6 |
Title of publication | Abrupt versus Gradual Spin-Crossover in Fe(II)(phen)2(NCS)2 and Fe(III)(dedtc)3 Compared by X-ray Absorption and Emission Spectroscopy and Quantum-Chemical Calculations. |
Authors of publication | Mebs, Stefan; Braun, Beatrice; Kositzki, Ramona; Limberg, Christian; Haumann, Michael |
Journal of publication | Inorganic chemistry |
Year of publication | 2015 |
Journal volume | 54 |
Journal issue | 24 |
Pages of publication | 11606 - 11624 |
a | 13.9918 ± 0.0009 Å |
b | 10.2185 ± 0.0007 Å |
c | 16.9335 ± 0.0011 Å |
α | 90° |
β | 110.485 ± 0.0018° |
γ | 90° |
Cell volume | 2268 ± 0.3 Å3 |
Cell temperature | 100 ± 2 K |
Ambient diffraction temperature | 100 ± 2 K |
Number of distinct elements | 5 |
Space group number | 15 |
Hermann-Mauguin space group symbol | C 1 2/c 1 |
Hall space group symbol | -C 2yc |
Residual factor for all reflections | 0.0502 |
Residual factor for significantly intense reflections | 0.036 |
Weighted residual factors for significantly intense reflections | 0.0805 |
Weighted residual factors for all reflections included in the refinement | 0.0863 |
Goodness-of-fit parameter for all reflections included in the refinement | 1.05 |
Diffraction radiation wavelength | 0.71073 Å |
Diffraction radiation type | MoKα |