Information card for entry 4346635
Common name | Tufan_1_59 |
Formula | C30 H31 Mn N5 |
Calculated formula | C30 H31 Mn N5 |
Title of publication | A Pentacoordinate Mn(II) Precatalyst That Exhibits Notable Aldehyde and Ketone Hydrosilylation Turnover Frequencies. |
Authors of publication | Ghosh, Chandrani; Mukhopadhyay, Tufan K.; Flores, Marco; Groy, Thomas L.; Trovitch, Ryan J. |
Journal of publication | Inorganic chemistry |
Year of publication | 2015 |
Journal volume | 54 |
Journal issue | 21 |
Pages of publication | 10398 - 10406 |
a | 11.803 ± 0.003 Å |
b | 17.331 ± 0.004 Å |
c | 13.28 ± 0.003 Å |
α | 90° |
β | 103.23 ± 0.004° |
γ | 90° |
Cell volume | 2644.4 ± 1.1 Å3 |
Cell temperature | 123 ± 2 K |
Ambient diffraction temperature | 123 ± 2 K |
Number of distinct elements | 4 |
Space group number | 15 |
Hermann-Mauguin space group symbol | C 1 2/c 1 |
Hall space group symbol | -C 2yc |
Residual factor for all reflections | 0.0521 |
Residual factor for significantly intense reflections | 0.0367 |
Weighted residual factors for significantly intense reflections | 0.0722 |
Weighted residual factors for all reflections included in the refinement | 0.0787 |
Goodness-of-fit parameter for all reflections included in the refinement | 1.025 |
Diffraction radiation wavelength | 0.71073 Å |
Diffraction radiation type | MoKα |