Information card for entry 4346640
Formula | C2 H103 As2 Na15 O120 Ti2 W18 |
Calculated formula | As2 Na10.85 O97.5 Ti2 W18 |
Title of publication | Ti2-Containing 18-Tungsto-2-Arsenate(III) Monolacunary Host and the Incorporation of a Phenylantimony(III) Guest. |
Authors of publication | Wang, Kai-Yao; Lin, Zhengguo; Bassil, Bassem S.; Xing, Xiaolin; Haider, Ali; Keita, Bineta; Zhang, Guangjin; Silvestru, Cristian; Kortz, Ulrich |
Journal of publication | Inorganic chemistry |
Year of publication | 2015 |
Journal volume | 54 |
Journal issue | 22 |
Pages of publication | 10530 - 10532 |
a | 13.0567 ± 0.0005 Å |
b | 17.1828 ± 0.0006 Å |
c | 22.4023 ± 0.0007 Å |
α | 91.934 ± 0.002° |
β | 90.04 ± 0.002° |
γ | 98.811 ± 0.002° |
Cell volume | 4963.7 ± 0.3 Å3 |
Cell temperature | 100 ± 2 K |
Ambient diffraction temperature | 100 ± 2 K |
Number of distinct elements | 7 |
Space group number | 2 |
Hermann-Mauguin space group symbol | P -1 |
Hall space group symbol | -P 1 |
Residual factor for all reflections | 0.0573 |
Residual factor for significantly intense reflections | 0.0504 |
Weighted residual factors for significantly intense reflections | 0.1199 |
Weighted residual factors for all reflections included in the refinement | 0.1234 |
Goodness-of-fit parameter for all reflections included in the refinement | 1.004 |
Diffraction radiation wavelength | 0.71073 Å |
Diffraction radiation type | MoKα |