Information card for entry 4346680
Formula | C49 H35 Co3 N4 O12 |
Calculated formula | C49 H35 Co3 N4 O12 |
Title of publication | Co(II)-MOF: A Highly Efficient Organic Oxidation Catalyst with Open Metal Sites. |
Authors of publication | Wang, Jian-Cheng; Ding, Feng-Wen; Ma, Jian-Ping; Liu, Qi-Kui; Cheng, Jun-Yan; Dong, Yu-Bin |
Journal of publication | Inorganic chemistry |
Year of publication | 2015 |
Journal volume | 54 |
Journal issue | 22 |
Pages of publication | 10865 - 10872 |
a | 11.6664 ± 0.0006 Å |
b | 14.9859 ± 0.0008 Å |
c | 19.4221 ± 0.0011 Å |
α | 75.584 ± 0.005° |
β | 75.343 ± 0.005° |
γ | 87.679 ± 0.004° |
Cell volume | 3180.7 ± 0.3 Å3 |
Cell temperature | 100 ± 0.1 K |
Ambient diffraction temperature | 100 ± 0.1 K |
Number of distinct elements | 5 |
Space group number | 2 |
Hermann-Mauguin space group symbol | P -1 |
Hall space group symbol | -P 1 |
Residual factor for all reflections | 0.0509 |
Residual factor for significantly intense reflections | 0.0396 |
Weighted residual factors for significantly intense reflections | 0.1049 |
Weighted residual factors for all reflections included in the refinement | 0.1123 |
Goodness-of-fit parameter for all reflections included in the refinement | 1.038 |
Diffraction radiation probe | x-ray |
Diffraction radiation wavelength | 0.71073 Å |
Diffraction radiation type | MoKα |