Information card for entry 4346682
Formula | C50 H39 Co3 N4 O13 |
Calculated formula | C50 H39 Co3 N4 O13 |
Title of publication | Co(II)-MOF: A Highly Efficient Organic Oxidation Catalyst with Open Metal Sites. |
Authors of publication | Wang, Jian-Cheng; Ding, Feng-Wen; Ma, Jian-Ping; Liu, Qi-Kui; Cheng, Jun-Yan; Dong, Yu-Bin |
Journal of publication | Inorganic chemistry |
Year of publication | 2015 |
Journal volume | 54 |
Journal issue | 22 |
Pages of publication | 10865 - 10872 |
a | 11.5784 ± 0.0007 Å |
b | 15.3081 ± 0.0012 Å |
c | 19.258 ± 0.0011 Å |
α | 70.388 ± 0.006° |
β | 76.659 ± 0.005° |
γ | 83.048 ± 0.006° |
Cell volume | 3125 ± 0.4 Å3 |
Cell temperature | 100 ± 0.1 K |
Ambient diffraction temperature | 100 ± 0.1 K |
Number of distinct elements | 5 |
Space group number | 2 |
Hermann-Mauguin space group symbol | P -1 |
Hall space group symbol | -P 1 |
Residual factor for all reflections | 0.1066 |
Residual factor for significantly intense reflections | 0.0706 |
Weighted residual factors for significantly intense reflections | 0.1768 |
Weighted residual factors for all reflections included in the refinement | 0.1979 |
Goodness-of-fit parameter for all reflections included in the refinement | 0.945 |
Diffraction radiation probe | x-ray |
Diffraction radiation wavelength | 1.54184 Å |
Diffraction radiation type | CuKα |