Information card for entry 4346728
Formula | C26 H56 Cl In N2 O4 P4 |
Calculated formula | C26 H56 Cl In N2 O4 P4 |
Title of publication | Rapid, Reversible, Solid-Gas and Solution-Phase Insertion of CO2 into In-P Bonds. |
Authors of publication | Dickie, Diane A.; Barker, Madeline T.; Land, Michael A.; Hughes, Kira E.; Clyburne, Jason A. C.; Kemp, Richard A. |
Journal of publication | Inorganic chemistry |
Year of publication | 2015 |
Journal volume | 54 |
Journal issue | 23 |
Pages of publication | 11121 - 11126 |
a | 18.9863 ± 0.0006 Å |
b | 12.2031 ± 0.0004 Å |
c | 15.6316 ± 0.0005 Å |
α | 90° |
β | 102.349 ± 0.002° |
γ | 90° |
Cell volume | 3537.9 ± 0.2 Å3 |
Cell temperature | 100 ± 2 K |
Ambient diffraction temperature | 100 ± 2 K |
Number of distinct elements | 7 |
Space group number | 14 |
Hermann-Mauguin space group symbol | P 1 21/c 1 |
Hall space group symbol | -P 2ybc |
Residual factor for all reflections | 0.0274 |
Residual factor for significantly intense reflections | 0.0229 |
Weighted residual factors for significantly intense reflections | 0.0547 |
Weighted residual factors for all reflections included in the refinement | 0.0569 |
Goodness-of-fit parameter for all reflections included in the refinement | 1.034 |
Diffraction radiation wavelength | 0.71073 Å |
Diffraction radiation type | MoKα |