Information card for entry 4346773
Formula | C47 H37 Cl2 N3 P2 Pd |
Calculated formula | C47 H37 Cl2 N3 P2 Pd |
SMILES | [Pd]([P](c1ccccc1)(c1ccccc1)c1ccccc1)([P](c1ccccc1)(c1ccccc1)c1ccccc1)(Cl)c1cccc(Cl)c1/N=N/c1ncccc1 |
Title of publication | Regioselective ortho Amination of Coordinated 2-(Arylazo)pyridine. Isolation of Monoradical Palladium Complexes of a New Series of Azo-Aromatic Pincer Ligands. |
Authors of publication | Sengupta, Debabrata; Chowdhury, Nabanita Saha; Samanta, Subhas; Ghosh, Pradip; Seth, Saikat Kumar; Demeshko, Serhiy; Meyer, Franc; Goswami, Sreebrata |
Journal of publication | Inorganic chemistry |
Year of publication | 2015 |
Journal volume | 54 |
Journal issue | 23 |
Pages of publication | 11465 - 11476 |
a | 10.669 ± 0.005 Å |
b | 12.002 ± 0.005 Å |
c | 16.139 ± 0.005 Å |
α | 80.675 ± 0.005° |
β | 82.573 ± 0.005° |
γ | 89.627 ± 0.005° |
Cell volume | 2021.9 ± 1.4 Å3 |
Cell temperature | 293 ± 2 K |
Ambient diffraction temperature | 293 ± 2 K |
Number of distinct elements | 6 |
Space group number | 2 |
Hermann-Mauguin space group symbol | P -1 |
Hall space group symbol | -P 1 |
Residual factor for all reflections | 0.0898 |
Residual factor for significantly intense reflections | 0.0521 |
Weighted residual factors for significantly intense reflections | 0.1197 |
Weighted residual factors for all reflections included in the refinement | 0.1449 |
Goodness-of-fit parameter for all reflections included in the refinement | 0.87 |
Diffraction radiation wavelength | 0.71073 Å |
Diffraction radiation type | MoKα |