Information card for entry 4346779
Formula | C26 H33 B2 Co F8 N8 P |
Calculated formula | C26 H33 B2 Co F8 N8 P |
Title of publication | Flexibility is Key: Synthesis of a Tripyridylamine (TPA) Congener with a Phosphorus Apical Donor and Coordination to Cobalt(II). |
Authors of publication | Thammavongsy, Zachary; Khosrowabadi Kotyk, Juliet F.; Tsay, Charlene; Yang, Jenny Y. |
Journal of publication | Inorganic chemistry |
Year of publication | 2015 |
Journal volume | 54 |
Journal issue | 23 |
Pages of publication | 11505 - 11510 |
a | 12.0758 ± 0.0005 Å |
b | 12.8 ± 0.0005 Å |
c | 20.1759 ± 0.0008 Å |
α | 90° |
β | 90° |
γ | 90° |
Cell volume | 3118.6 ± 0.2 Å3 |
Cell temperature | 88 ± 2 K |
Ambient diffraction temperature | 88 ± 2 K |
Number of distinct elements | 7 |
Space group number | 19 |
Hermann-Mauguin space group symbol | P 21 21 21 |
Hall space group symbol | P 2ac 2ab |
Residual factor for all reflections | 0.0437 |
Residual factor for significantly intense reflections | 0.0377 |
Weighted residual factors for significantly intense reflections | 0.0957 |
Weighted residual factors for all reflections included in the refinement | 0.1003 |
Goodness-of-fit parameter for all reflections included in the refinement | 0.983 |
Diffraction radiation wavelength | 0.71073 Å |
Diffraction radiation type | MoKα |