Information card for entry 4346783
Formula | C35 H55 N O Os P2 |
Calculated formula | C35 H55 N O Os P2 |
SMILES | [OsH2]12([P](C(C)C)(C(C)C)C(C)C)([P](C(C)C)(C(C)C)C(C)C)[n]3c(C=C2Oc2c1cccc2)ccc1c3cccc1 |
Title of publication | 2-Azetidinones as Precursors of Pincer Ligands: Preparation, Structure, and Spectroscopic Properties of CC'N-Osmium Complexes. |
Authors of publication | Casarrubios, Luis; Esteruelas, Miguel A.; Larramona, Carmen; Muntaner, Jaime G.; Oñate, Enrique; Sierra, Miguel A. |
Journal of publication | Inorganic chemistry |
Year of publication | 2015 |
Journal volume | 54 |
Journal issue | 22 |
Pages of publication | 10998 - 11006 |
a | 14.0888 ± 0.001 Å |
b | 15.8579 ± 0.0011 Å |
c | 15.2962 ± 0.001 Å |
α | 90° |
β | 93.224 ± 0.001° |
γ | 90° |
Cell volume | 3412 ± 0.4 Å3 |
Cell temperature | 100 ± 2 K |
Ambient diffraction temperature | 100 ± 2 K |
Number of distinct elements | 6 |
Space group number | 14 |
Hermann-Mauguin space group symbol | P 1 21/n 1 |
Hall space group symbol | -P 2yn |
Residual factor for all reflections | 0.0764 |
Residual factor for significantly intense reflections | 0.0486 |
Weighted residual factors for significantly intense reflections | 0.0781 |
Weighted residual factors for all reflections included in the refinement | 0.0858 |
Goodness-of-fit parameter for all reflections included in the refinement | 1.072 |
Diffraction radiation wavelength | 0.71073 Å |
Diffraction radiation type | MoKα |