Information card for entry 4346786
Formula | C30 H42 N4 |
Calculated formula | C30 H42 N4 |
Title of publication | Copper(I) Complexes of Zwitterionic Imidazolium-2-Amidinates, a Promising Class of Electroneutral, Amidinate-Type Ligands. |
Authors of publication | Márquez, Astrid; Ávila, Elena; Urbaneja, Carmen; Álvarez, Eleuterio; Palma, Pilar; Cámpora, Juan |
Journal of publication | Inorganic chemistry |
Year of publication | 2015 |
Journal volume | 54 |
Journal issue | 22 |
Pages of publication | 11007 - 11017 |
a | 14.6732 ± 0.0008 Å |
b | 19.9967 ± 0.0011 Å |
c | 20.9683 ± 0.001 Å |
α | 109.399 ± 0.002° |
β | 106.206 ± 0.002° |
γ | 90.741 ± 0.002° |
Cell volume | 5534.5 ± 0.5 Å3 |
Cell temperature | 213 ± 2 K |
Ambient diffraction temperature | 213 ± 2 K |
Number of distinct elements | 3 |
Space group number | 2 |
Hermann-Mauguin space group symbol | P -1 |
Hall space group symbol | -P 1 |
Residual factor for all reflections | 0.173 |
Residual factor for significantly intense reflections | 0.0965 |
Weighted residual factors for significantly intense reflections | 0.2659 |
Weighted residual factors for all reflections included in the refinement | 0.2901 |
Goodness-of-fit parameter for all reflections included in the refinement | 1.058 |
Diffraction radiation wavelength | 0.71073 Å |
Diffraction radiation type | MoKα |