Information card for entry 4346791
Formula | C138 H153 B2 Cu2 N12 |
Calculated formula | C138 H153 B2 Cu2 N12 |
SMILES | [Cu]123[Cu]([N](=C(N1c1ccc(cc1)C)c1n(cc[n+]1C1CCCCC1)C1CCCCC1)c1ccc(cc1)C)([N](=C(N2c1ccc(cc1)C)c1n(cc[n+]1C1CCCCC1)C1CCCCC1)c1ccc(cc1)C)[N](=C(N3c1ccc(cc1)C)c1n(cc[n+]1C1CCCCC1)C1CCCCC1)c1ccc(cc1)C.[B-](c1ccccc1)(c1ccccc1)(c1ccccc1)c1ccccc1.[B-](c1ccccc1)(c1ccccc1)(c1ccccc1)c1ccccc1 |
Title of publication | Copper(I) Complexes of Zwitterionic Imidazolium-2-Amidinates, a Promising Class of Electroneutral, Amidinate-Type Ligands. |
Authors of publication | Márquez, Astrid; Ávila, Elena; Urbaneja, Carmen; Álvarez, Eleuterio; Palma, Pilar; Cámpora, Juan |
Journal of publication | Inorganic chemistry |
Year of publication | 2015 |
Journal volume | 54 |
Journal issue | 22 |
Pages of publication | 11007 - 11017 |
a | 15.8146 ± 0.0015 Å |
b | 19.303 ± 0.002 Å |
c | 25.166 ± 0.003 Å |
α | 79.992 ± 0.003° |
β | 80.974 ± 0.003° |
γ | 80.493 ± 0.003° |
Cell volume | 7396.3 ± 1.4 Å3 |
Cell temperature | 213 ± 2 K |
Ambient diffraction temperature | 213 ± 2 K |
Number of distinct elements | 5 |
Space group number | 2 |
Hermann-Mauguin space group symbol | P -1 |
Hall space group symbol | -P 1 |
Residual factor for all reflections | 0.1602 |
Residual factor for significantly intense reflections | 0.0716 |
Weighted residual factors for significantly intense reflections | 0.1645 |
Weighted residual factors for all reflections included in the refinement | 0.1856 |
Goodness-of-fit parameter for all reflections included in the refinement | 0.872 |
Diffraction radiation wavelength | 0.71073 Å |
Diffraction radiation type | MoKα |