Information card for entry 4346945
Formula | C66 H78 Co3 N6 O9 |
Calculated formula | C66 H78 Co3 N6 O9 |
Title of publication | Molecular and Electronic Structures of Homoleptic Six-Coordinate Cobalt(I) Complexes of 2,2':6',2″-Terpyridine, 2,2'-Bipyridine, and 1,10-Phenanthroline. An Experimental and Computational Study. |
Authors of publication | England, Jason; Bill, Eckhard; Weyhermüller, Thomas; Neese, Frank; Atanasov, Mihail; Wieghardt, Karl |
Journal of publication | Inorganic chemistry |
Year of publication | 2015 |
Journal volume | 54 |
Journal issue | 24 |
Pages of publication | 12002 - 12018 |
a | 18.432 ± 0.002 Å |
b | 16.797 ± 0.002 Å |
c | 20.428 ± 0.002 Å |
α | 90° |
β | 90.994 ± 0.002° |
γ | 90° |
Cell volume | 6323.6 ± 1.2 Å3 |
Cell temperature | 100 K |
Ambient diffraction temperature | 100 ± 2 K |
Number of distinct elements | 5 |
Space group number | 14 |
Hermann-Mauguin space group symbol | P 1 21/c 1 |
Hall space group symbol | -P 2ybc |
Residual factor for all reflections | 0.0471 |
Residual factor for significantly intense reflections | 0.0329 |
Weighted residual factors for significantly intense reflections | 0.0829 |
Weighted residual factors for all reflections included in the refinement | 0.0943 |
Goodness-of-fit parameter for all reflections included in the refinement | 1.058 |
Diffraction radiation wavelength | 0.71073 Å |
Diffraction radiation type | MoKα |