Information card for entry 4346947
Formula | C38 H38 Co F6 N6 O2 P |
Calculated formula | C38 H38 Co F6 N6 O2 P |
Title of publication | Molecular and Electronic Structures of Homoleptic Six-Coordinate Cobalt(I) Complexes of 2,2':6',2″-Terpyridine, 2,2'-Bipyridine, and 1,10-Phenanthroline. An Experimental and Computational Study. |
Authors of publication | England, Jason; Bill, Eckhard; Weyhermüller, Thomas; Neese, Frank; Atanasov, Mihail; Wieghardt, Karl |
Journal of publication | Inorganic chemistry |
Year of publication | 2015 |
Journal volume | 54 |
Journal issue | 24 |
Pages of publication | 12002 - 12018 |
a | 8.8263 ± 0.0005 Å |
b | 8.8263 ± 0.0005 Å |
c | 27.4049 ± 0.0011 Å |
α | 90° |
β | 90° |
γ | 90° |
Cell volume | 2134.94 ± 0.19 Å3 |
Cell temperature | 100 ± 2 K |
Ambient diffraction temperature | 100 ± 2 K |
Number of distinct elements | 7 |
Space group number | 82 |
Hermann-Mauguin space group symbol | I -4 |
Hall space group symbol | I -4 |
Residual factor for all reflections | 0.0982 |
Residual factor for significantly intense reflections | 0.0756 |
Weighted residual factors for significantly intense reflections | 0.1843 |
Weighted residual factors for all reflections included in the refinement | 0.2018 |
Goodness-of-fit parameter for all reflections included in the refinement | 1.12 |
Diffraction radiation wavelength | 0.71073 Å |
Diffraction radiation type | MoKα |