Information card for entry 4346972
Formula | C34 H52 B Cl5 F4 Fe N6 Pd |
Calculated formula | C34 H52 B Cl5 F4 Fe N6 Pd |
SMILES | [Fe]123456789%10[Pd](Cl)([N]([c]%111[cH]2[cH]3[cH]4[cH]5%11)=C1N(C(=C(N1C(C)C)C)C)C(C)C)[N]([c]16[cH]%10[cH]9[cH]8[cH]71)=C1N(C(=C(N1C(C)C)C)C)C(C)C.ClCCl.ClCCl.[B](F)(F)(F)[F-] |
Title of publication | Ni-Fe and Pd-Fe Interactions in Nickel(II) and Palladium(II) Complexes of a Ferrocene-Bridged Bis(imidazolin-2-imine) Ligand. |
Authors of publication | Jess, Kristof; Baabe, Dirk; Bannenberg, Thomas; Brandhorst, Kai; Freytag, Matthias; Jones, Peter G.; Tamm, Matthias |
Journal of publication | Inorganic chemistry |
Year of publication | 2015 |
Journal volume | 54 |
Journal issue | 24 |
Pages of publication | 12032 - 12045 |
a | 9.8323 ± 0.0003 Å |
b | 12.8828 ± 0.0004 Å |
c | 17.3905 ± 0.0006 Å |
α | 92.969 ± 0.003° |
β | 99.019 ± 0.003° |
γ | 107.107 ± 0.003° |
Cell volume | 2068.11 ± 0.12 Å3 |
Cell temperature | 100 ± 2 K |
Ambient diffraction temperature | 100 ± 2 K |
Number of distinct elements | 8 |
Space group number | 2 |
Hermann-Mauguin space group symbol | P -1 |
Hall space group symbol | -P 1 |
Residual factor for all reflections | 0.0406 |
Residual factor for significantly intense reflections | 0.0304 |
Weighted residual factors for significantly intense reflections | 0.0597 |
Weighted residual factors for all reflections included in the refinement | 0.0635 |
Goodness-of-fit parameter for all reflections included in the refinement | 1.061 |
Diffraction radiation wavelength | 0.71073 Å |
Diffraction radiation type | MoKα |