Information card for entry 4346974
Formula | C36 H54 B2 F8 Fe N8 Pd |
Calculated formula | C36 H51 B2 F8 Fe N8 Pd |
Title of publication | Ni-Fe and Pd-Fe Interactions in Nickel(II) and Palladium(II) Complexes of a Ferrocene-Bridged Bis(imidazolin-2-imine) Ligand. |
Authors of publication | Jess, Kristof; Baabe, Dirk; Bannenberg, Thomas; Brandhorst, Kai; Freytag, Matthias; Jones, Peter G.; Tamm, Matthias |
Journal of publication | Inorganic chemistry |
Year of publication | 2015 |
Journal volume | 54 |
Journal issue | 24 |
Pages of publication | 12032 - 12045 |
a | 9.792 ± 0.0004 Å |
b | 11.4004 ± 0.0004 Å |
c | 19.621 ± 0.0006 Å |
α | 91.876 ± 0.003° |
β | 92.225 ± 0.003° |
γ | 107.924 ± 0.003° |
Cell volume | 2080.17 ± 0.13 Å3 |
Cell temperature | 100 ± 2 K |
Ambient diffraction temperature | 100 ± 2 K |
Number of distinct elements | 7 |
Space group number | 2 |
Hermann-Mauguin space group symbol | P -1 |
Hall space group symbol | -P 1 |
Residual factor for all reflections | 0.0613 |
Residual factor for significantly intense reflections | 0.0481 |
Weighted residual factors for significantly intense reflections | 0.1104 |
Weighted residual factors for all reflections included in the refinement | 0.1171 |
Goodness-of-fit parameter for all reflections included in the refinement | 1.048 |
Diffraction radiation wavelength | 0.71073 Å |
Diffraction radiation type | MoKα |