Information card for entry 4348392
Formula | C31 H28 Co N4 O12 |
Calculated formula | C31 H27 Co N4 O12 |
Title of publication | Assembly, structures, photophysical properties and photocatalytic activities of a series of coordination polymers constructed from semi-rigid bis-pyridyl-bis-amide and benzenetricarboxylic acid |
Authors of publication | Wang, Xiuli; Le, Mao; Lin, Hong-Yan; Luan, Jian; Liu, Guo-Cheng; Sui, Fang-Fang; Chang, Zhi-Han |
Journal of publication | Inorganic Chemistry Frontiers |
Year of publication | 2015 |
Journal volume | 2 |
Journal issue | 4 |
Pages of publication | 373 |
a | 10.0522 ± 0.0016 Å |
b | 11.4431 ± 0.0018 Å |
c | 15.205 ± 0.002 Å |
α | 96.493 ± 0.003° |
β | 102.803 ± 0.003° |
γ | 105.101 ± 0.002° |
Cell volume | 1619.3 ± 0.4 Å3 |
Cell temperature | 296 ± 2 K |
Ambient diffraction temperature | 296 ± 2 K |
Number of distinct elements | 5 |
Space group number | 2 |
Hermann-Mauguin space group symbol | P -1 |
Hall space group symbol | -P 1 |
Residual factor for all reflections | 0.0511 |
Residual factor for significantly intense reflections | 0.0443 |
Weighted residual factors for significantly intense reflections | 0.1429 |
Weighted residual factors for all reflections included in the refinement | 0.1501 |
Goodness-of-fit parameter for all reflections included in the refinement | 1.084 |
Diffraction radiation wavelength | 0.71073 Å |
Diffraction radiation type | MoKα |