Information card for entry 4348410
Formula | C60 H50 N2 S8 Zn4 |
Calculated formula | C60 H50 N2 S8 Zn4 |
Title of publication | Construction of a series of zero-dimensional/one-dimensional crystalline Zn‒S clusters ‒ effect of the character of bridging organic ligands on structural diversity |
Authors of publication | Zeng, Xianghua; Yao, Xiaojing; Zhang, Junyong; Zhang, Qi; Wu, Wenqian; Chai, Aihua; Wang, Jinlan; Zeng, Qingdao; Xie, Jingli |
Journal of publication | Inorganic Chemistry Frontiers |
Year of publication | 2015 |
Journal volume | 2 |
Journal issue | 2 |
Pages of publication | 164 |
a | 13.3661 ± 0.0002 Å |
b | 24.0675 ± 0.0003 Å |
c | 19.021 ± 0.0004 Å |
α | 90° |
β | 105.48 ± 0.002° |
γ | 90° |
Cell volume | 5896.87 ± 0.18 Å3 |
Cell temperature | 150 ± 2 K |
Ambient diffraction temperature | 150 ± 2 K |
Number of distinct elements | 5 |
Space group number | 14 |
Hermann-Mauguin space group symbol | P 1 21/n 1 |
Hall space group symbol | -P 2yn |
Residual factor for all reflections | 0.0548 |
Residual factor for significantly intense reflections | 0.0334 |
Weighted residual factors for significantly intense reflections | 0.0641 |
Weighted residual factors for all reflections included in the refinement | 0.0726 |
Goodness-of-fit parameter for all reflections included in the refinement | 1.032 |
Diffraction radiation wavelength | 0.71073 Å |
Diffraction radiation type | MoKα |