Information card for entry 4348618
Formula | C14 H22 B N2 Rh |
Calculated formula | C14 H22 B N2 Rh |
SMILES | [CH]12=[CH]3CC[CH]4=[CH](CC1)[Rh]15234[H][BH]([n]2c(cccc2)N1C)[H]5 |
Title of publication | 2-(Methylamido)pyridine-Borane: A Tripod κ(3)-N,H,H Ligand in Trigonal Bipyramidal Rhodium(I) and Iridium(I) Complexes with an Asymmetric Coordination of Its BH3 Group. |
Authors of publication | Brugos, Javier; Cabeza, Javier A.; García-Álvarez, Pablo; Kennedy, Alan R.; Pérez-Carreño, Enrique; Van der Maelen, Juan F. |
Journal of publication | Inorganic chemistry |
Year of publication | 2016 |
Journal volume | 55 |
Journal issue | 17 |
Pages of publication | 8905 - 8912 |
a | 12.0519 ± 0.001 Å |
b | 7.3434 ± 0.0002 Å |
c | 21.4669 ± 0.0017 Å |
α | 90° |
β | 135.213 ± 0.015° |
γ | 90° |
Cell volume | 1338.4 ± 0.4 Å3 |
Cell temperature | 156 ± 2 K |
Ambient diffraction temperature | 156 ± 2 K |
Number of distinct elements | 5 |
Space group number | 14 |
Hermann-Mauguin space group symbol | P 1 21/c 1 |
Hall space group symbol | -P 2ybc |
Residual factor for all reflections | 0.0316 |
Residual factor for significantly intense reflections | 0.0303 |
Weighted residual factors for significantly intense reflections | 0.0815 |
Weighted residual factors for all reflections included in the refinement | 0.0901 |
Goodness-of-fit parameter for all reflections included in the refinement | 1.132 |
Diffraction radiation wavelength | 1.5418 Å |
Diffraction radiation type | CuKα |