Information card for entry 4348789
Formula | C6 H4 N24 O8 Pb3 |
Calculated formula | C6 H4 N24 O8 Pb3 |
Title of publication | Structural Modulation from 1D Chain to 3D Framework: Improved Thermostability, Insensitivity, and Energies of Two Nitrogen-Rich Energetic Coordination Polymers. |
Authors of publication | Guo, Zhaoqi; Wu, Yunlong; Deng, Chongqing; Yang, Guoping; Zhang, Jiangong; Sun, Zhihua; Ma, Haixia; Gao, Chao; An, Zhongwei |
Journal of publication | Inorganic chemistry |
Year of publication | 2016 |
Journal volume | 55 |
Journal issue | 21 |
Pages of publication | 11064 - 11071 |
a | 13.8912 ± 0.0018 Å |
b | 24.074 ± 0.003 Å |
c | 8.5487 ± 0.0011 Å |
α | 90° |
β | 96.655 ± 0.002° |
γ | 90° |
Cell volume | 2839.6 ± 0.6 Å3 |
Cell temperature | 296 ± 2 K |
Ambient diffraction temperature | 296 ± 2 K |
Number of distinct elements | 5 |
Space group number | 15 |
Hermann-Mauguin space group symbol | C 1 2/c 1 |
Hall space group symbol | -C 2yc |
Residual factor for all reflections | 0.0463 |
Residual factor for significantly intense reflections | 0.0428 |
Weighted residual factors for significantly intense reflections | 0.1316 |
Weighted residual factors for all reflections included in the refinement | 0.1349 |
Goodness-of-fit parameter for all reflections included in the refinement | 1.072 |
Diffraction radiation wavelength | 0.71073 Å |
Diffraction radiation type | MoKα |