Information card for entry 4348819
Formula | C12 Co O20 U2 |
Calculated formula | C12 Co O20 U2 |
Title of publication | Series of Hydrated Heterometallic Uranyl-Cobalt(II) Coordination Polymers with Aromatic Polycarboxylate Ligands: Formation of U═O-Co Bonding upon Dehydration Process. |
Authors of publication | Falaise, Clément; Delille, Jason; Volkringer, Christophe; Vezin, Hervé; Rabu, Pierre; Loiseau, Thierry |
Journal of publication | Inorganic chemistry |
Year of publication | 2016 |
Journal volume | 55 |
Journal issue | 20 |
Pages of publication | 10453 - 10466 |
a | 6.8061 ± 0.0006 Å |
b | 8.2468 ± 0.0007 Å |
c | 9.0956 ± 0.0008 Å |
α | 103.824 ± 0.004° |
β | 94.823 ± 0.004° |
γ | 102.719 ± 0.004° |
Cell volume | 478.51 ± 0.07 Å3 |
Cell temperature | 293 ± 2 K |
Ambient diffraction temperature | 293 ± 2 K |
Number of distinct elements | 4 |
Space group number | 2 |
Hermann-Mauguin space group symbol | P -1 |
Hall space group symbol | -P 1 |
Residual factor for all reflections | 0.0205 |
Residual factor for significantly intense reflections | 0.0175 |
Weighted residual factors for significantly intense reflections | 0.0374 |
Weighted residual factors for all reflections included in the refinement | 0.0382 |
Goodness-of-fit parameter for all reflections included in the refinement | 1.067 |
Diffraction radiation wavelength | 0.71073 Å |
Diffraction radiation type | MoKα |