Information card for entry 4348904
Formula | C50.5 H21 F20 N5 O3.5 Zn |
Calculated formula | C50.5 H21 F20 N5 O3.5 Zn |
Title of publication | Stable iso-bacteriochlorin mimics from porpholactone: effect of a β-oxazolone moiety on the frontier π-molecular orbitals |
Authors of publication | Yu, Yi; Furuyama, Taniyuki; Tang, Juan; Wu, Zhuo-Yan; Chen, Jia-Zhen; Kobayashi, Nagao; Zhang, Jun-Long |
Journal of publication | Inorganic Chemistry Frontiers |
Year of publication | 2015 |
Journal volume | 2 |
Journal issue | 7 |
Pages of publication | 671 |
a | 11.9214 ± 0.0004 Å |
b | 16.6064 ± 0.0004 Å |
c | 24.9688 ± 0.0007 Å |
α | 90° |
β | 102.516 ± 0.003° |
γ | 90° |
Cell volume | 4825.6 ± 0.2 Å3 |
Cell temperature | 99.99 ± 0.18 K |
Ambient diffraction temperature | 99.99 ± 0.18 K |
Number of distinct elements | 6 |
Space group number | 14 |
Hermann-Mauguin space group symbol | P 1 21/n 1 |
Hall space group symbol | -P 2yn |
Residual factor for all reflections | 0.1084 |
Residual factor for significantly intense reflections | 0.0913 |
Weighted residual factors for significantly intense reflections | 0.2412 |
Weighted residual factors for all reflections included in the refinement | 0.2522 |
Goodness-of-fit parameter for all reflections included in the refinement | 1.145 |
Diffraction radiation wavelength | 0.7107 Å |
Diffraction radiation type | MoKα |