Information card for entry 4348942
Formula | C16 H22 Cu N2 O11 |
Calculated formula | C16 H22 Cu N2 O11 |
Title of publication | Transformation of One-Dimensional Achiral Structure to Three-Dimensional Chiral Structure: Mechanistic Study and Catalytic Activities of Chiral Structure. |
Authors of publication | Rao, Purna Chandra; Chaudhary, Sonu Pratap; Kuznetsov, Denis; Mandal, Sukhendu |
Journal of publication | Inorganic chemistry |
Year of publication | 2016 |
Journal volume | 55 |
Journal issue | 24 |
Pages of publication | 12669 - 12674 |
a | 7.0884 ± 0.0004 Å |
b | 11.1739 ± 0.0006 Å |
c | 23.9893 ± 0.0012 Å |
α | 90° |
β | 92.168 ± 0.003° |
γ | 90° |
Cell volume | 1898.71 ± 0.18 Å3 |
Cell temperature | 293 ± 2 K |
Ambient diffraction temperature | 293 ± 2 K |
Number of distinct elements | 5 |
Space group number | 14 |
Hermann-Mauguin space group symbol | P 1 21/c 1 |
Hall space group symbol | -P 2ybc |
Residual factor for all reflections | 0.0492 |
Residual factor for significantly intense reflections | 0.0317 |
Weighted residual factors for significantly intense reflections | 0.0743 |
Weighted residual factors for all reflections included in the refinement | 0.0803 |
Goodness-of-fit parameter for all reflections included in the refinement | 1.038 |
Diffraction radiation wavelength | 0.71073 Å |
Diffraction radiation type | MoKα |