Information card for entry 4348965
Formula | C16 H126 Ag8 Mn8 N16 Na O159 Sb2 W32 |
Calculated formula | C16 H70 Ag8 Mn8 N16 Na O159 Sb2 W32 |
Title of publication | Sandwich-Type Polyoxotungstate Consisting of Two Different Trilacunary Keggin-Type Units. |
Authors of publication | Han, Zhan-Gang; Zhang, Hui-Xia; Zhang, De-Shun; Liu, Chun-Na; Zheng, Ran; Xia, Gui-Bin; Wang, Xiao-Xiao |
Journal of publication | Inorganic chemistry |
Year of publication | 2016 |
Journal volume | 55 |
Journal issue | 24 |
Pages of publication | 12488 - 12491 |
a | 14.683 ± 0.002 Å |
b | 17.033 ± 0.002 Å |
c | 17.605 ± 0.003 Å |
α | 110.022 ± 0.002° |
β | 91.256 ± 0.002° |
γ | 91.279 ± 0.002° |
Cell volume | 4133.7 ± 1 Å3 |
Cell temperature | 296 ± 2 K |
Ambient diffraction temperature | 296 ± 2 K |
Number of distinct elements | 9 |
Space group number | 2 |
Hermann-Mauguin space group symbol | P -1 |
Hall space group symbol | -P 1 |
Residual factor for all reflections | 0.1082 |
Residual factor for significantly intense reflections | 0.0692 |
Weighted residual factors for significantly intense reflections | 0.1807 |
Weighted residual factors for all reflections included in the refinement | 0.2169 |
Goodness-of-fit parameter for all reflections included in the refinement | 1.014 |
Diffraction radiation wavelength | 0.71073 Å |
Diffraction radiation type | MoKα |