Information card for entry 4349007
Formula | C48 H35.5 Br Dy N3 O5.25 |
Calculated formula | C48 H33 Br Dy N3 O5.25 |
Title of publication | Modulating single-molecule magnet behaviour of phenoxo-O bridged lanthanide(iii) dinuclear complexes by using different β-diketonate coligands |
Authors of publication | Wang, Wen-Min; Wang, Shi-Yu; Zhang, Hong-Xia; Shen, Hai-Yun; Zou, Ji-Yong; Gao, Hong-Ling; Cui, Jian-Zhong; Zhao, Bin |
Journal of publication | Inorganic Chemistry Frontiers |
Year of publication | 2016 |
Journal volume | 3 |
Journal issue | 1 |
Pages of publication | 133 |
a | 16.748 ± 0.003 Å |
b | 16.799 ± 0.003 Å |
c | 17.363 ± 0.004 Å |
α | 82.67 ± 0.03° |
β | 70.83 ± 0.03° |
γ | 62.46 ± 0.03° |
Cell volume | 4090 ± 2 Å3 |
Cell temperature | 113 ± 2 K |
Ambient diffraction temperature | 113 ± 2 K |
Number of distinct elements | 6 |
Space group number | 2 |
Hermann-Mauguin space group symbol | P -1 |
Hall space group symbol | -P 1 |
Residual factor for all reflections | 0.0553 |
Residual factor for significantly intense reflections | 0.0409 |
Weighted residual factors for significantly intense reflections | 0.0954 |
Weighted residual factors for all reflections included in the refinement | 0.1024 |
Goodness-of-fit parameter for all reflections included in the refinement | 1.071 |
Diffraction radiation wavelength | 0.71073 Å |
Diffraction radiation type | MoKα |