Information card for entry 4349062
Formula | C28 H49 Fe I N2 |
Calculated formula | C28 H49 Fe I N2 |
SMILES | [Fe]1234(I)([c]5([c]1([cH]2[c]3([cH]45)C(C)(C)C)C(C)(C)C)C(C)(C)C)=C1N(C(=C(N1C(C)C)C)C)C(C)C |
Title of publication | N-Heterocyclic carbene adducts to [Cp′FeI]2: synthesis and molecular and electronic structure |
Authors of publication | Reiners, Matthias; Baabe, Dirk; Harms, Kristoffer; Maekawa, Miyuki; Daniliuc, Constantin G.; Freytag, Matthias; Jones, Peter G.; Walter, Marc D. |
Journal of publication | Inorganic Chemistry Frontiers |
Year of publication | 2016 |
Journal volume | 3 |
Journal issue | 2 |
Pages of publication | 250 |
a | 9.35317 ± 0.00012 Å |
b | 18.27596 ± 0.00018 Å |
c | 17.01417 ± 0.00016 Å |
α | 90° |
β | 95.7372 ± 0.0008° |
γ | 90° |
Cell volume | 2893.8 ± 0.05 Å3 |
Cell temperature | 100 ± 2 K |
Ambient diffraction temperature | 100 ± 2 K |
Number of distinct elements | 5 |
Space group number | 14 |
Hermann-Mauguin space group symbol | P 1 21/n 1 |
Hall space group symbol | -P 2yn |
Residual factor for all reflections | 0.0251 |
Residual factor for significantly intense reflections | 0.0199 |
Weighted residual factors for significantly intense reflections | 0.0414 |
Weighted residual factors for all reflections included in the refinement | 0.0431 |
Goodness-of-fit parameter for all reflections included in the refinement | 1.055 |
Diffraction radiation wavelength | 0.71073 Å |
Diffraction radiation type | MoKα |