Information card for entry 4349481
Formula | C27 H17 Dy N0 O7 |
Calculated formula | C27 H17 Dy O7 |
Title of publication | Two-step warming solvothermal syntheses, luminescence and slow magnetic relaxation of isostructural dense LnMOFs based on nanoscale 3-connected linkers |
Authors of publication | Liu, Cai-Ming; Zhang, De-Qing; Zhao, Yong-Sheng; Hao, Xiang; Zhu, Dao-Ben |
Journal of publication | Inorganic Chemistry Frontiers |
Year of publication | 2016 |
Journal volume | 3 |
Journal issue | 8 |
Pages of publication | 1076 |
a | 22.497 ± 0.005 Å |
b | 28.847 ± 0.006 Å |
c | 28.988 ± 0.006 Å |
α | 90° |
β | 90° |
γ | 90° |
Cell volume | 18812 ± 7 Å3 |
Cell temperature | 173 ± 2 K |
Ambient diffraction temperature | 173 ± 2 K |
Number of distinct elements | 5 |
Space group number | 70 |
Hermann-Mauguin space group symbol | F d d d :2 |
Hall space group symbol | -F 2uv 2vw |
Residual factor for all reflections | 0.0938 |
Residual factor for significantly intense reflections | 0.0919 |
Weighted residual factors for significantly intense reflections | 0.2165 |
Weighted residual factors for all reflections included in the refinement | 0.2168 |
Goodness-of-fit parameter for all reflections included in the refinement | 1.123 |
Diffraction radiation wavelength | 0.71073 Å |
Diffraction radiation type | MoKα |