Information card for entry 4349619
Formula | C18 H11 N3 O4 |
Calculated formula | C18 H11 N3 O4 |
Title of publication | Coordination chemistry of N-picolyl-1,8-naphthalimides: colourful low molecular weight metallo-gelators and unique chelation behaviours |
Authors of publication | Lovitt, June I.; Hawes, Chris S.; Lynes, Amy D.; Haffner, Benjamin; Möbius, Matthias E.; Gunnlaugsson, Thorfinnur |
Journal of publication | Inorganic Chemistry Frontiers |
Year of publication | 2017 |
Journal volume | 4 |
Journal issue | 2 |
Pages of publication | 296 |
a | 14.4265 ± 0.0006 Å |
b | 11.5416 ± 0.0005 Å |
c | 17.5201 ± 0.0008 Å |
α | 90° |
β | 90° |
γ | 90° |
Cell volume | 2917.2 ± 0.2 Å3 |
Cell temperature | 100 ± 2 K |
Ambient diffraction temperature | 100.03 K |
Number of distinct elements | 4 |
Space group number | 61 |
Hermann-Mauguin space group symbol | P b c a |
Hall space group symbol | -P 2ac 2ab |
Residual factor for all reflections | 0.098 |
Residual factor for significantly intense reflections | 0.0588 |
Weighted residual factors for significantly intense reflections | 0.1346 |
Weighted residual factors for all reflections included in the refinement | 0.1506 |
Goodness-of-fit parameter for all reflections included in the refinement | 1.058 |
Diffraction radiation wavelength | 0.71073 Å |
Diffraction radiation type | MoKα |