Information card for entry 4349631
Formula | C74 H58 F12 Gd2 O18 |
Calculated formula | C74 H58 F12 Gd2 O18 |
Title of publication | Complementation and joint contribution of appropriate intramolecular coupling and local ion symmetry to improve magnetic relaxation in a series of dinuclear Dy2 single-molecule magnets |
Authors of publication | Tu, Hao-Ran; Sun, Wen-Bin; Li, Hong-Feng; Chen, Peng; Tian, Yong-Mei; Zhang, Wan-Ying; Zhang, Yi-Quan; Yan, Peng-Fei |
Journal of publication | Inorganic Chemistry Frontiers |
Year of publication | 2017 |
Journal volume | 4 |
Journal issue | 3 |
Pages of publication | 499 |
a | 10.5094 ± 0.0009 Å |
b | 14.2002 ± 0.001 Å |
c | 14.5239 ± 0.0011 Å |
α | 65.464 ± 0.007° |
β | 78.393 ± 0.007° |
γ | 68.374 ± 0.007° |
Cell volume | 1830 ± 0.3 Å3 |
Cell temperature | 293 ± 2 K |
Ambient diffraction temperature | 293 ± 2 K |
Number of distinct elements | 5 |
Space group number | 2 |
Hermann-Mauguin space group symbol | P -1 |
Hall space group symbol | -P 1 |
Residual factor for all reflections | 0.0525 |
Residual factor for significantly intense reflections | 0.0406 |
Weighted residual factors for significantly intense reflections | 0.1135 |
Weighted residual factors for all reflections included in the refinement | 0.1237 |
Goodness-of-fit parameter for all reflections included in the refinement | 1.051 |
Diffraction radiation probe | x-ray |
Diffraction radiation wavelength | 0.71073 Å |
Diffraction radiation type | MoKα |