Information card for entry 4349640
Formula | C58 H60 Ag2 B2 F8 Ni2 P4 S4 |
Calculated formula | C58 H60 Ag2 B2 F8 Ni2 P4 S4 |
Title of publication | Heteronuclear assembly of Ni‒Cu dithiolato complexes: synthesis, structures, and reactivity studies |
Authors of publication | Chu, Xiaoxiao; Xu, Xin; Su, Hao; Raje, Sakthi; Angamuthu, Raja; Tung, Chen-Ho; Wang, Wenguang |
Journal of publication | Inorganic Chemistry Frontiers |
Year of publication | 2017 |
Journal volume | 4 |
Journal issue | 4 |
Pages of publication | 706 |
a | 33.906 ± 0.002 Å |
b | 11.5072 ± 0.0006 Å |
c | 19.2841 ± 0.001 Å |
α | 90° |
β | 116.577 ± 0.003° |
γ | 90° |
Cell volume | 6728.9 ± 0.7 Å3 |
Cell temperature | 293 ± 2 K |
Ambient diffraction temperature | 293 ± 2 K |
Number of distinct elements | 8 |
Space group number | 15 |
Hermann-Mauguin space group symbol | C 1 2/c 1 |
Hall space group symbol | -C 2yc |
Residual factor for all reflections | 0.0878 |
Residual factor for significantly intense reflections | 0.0613 |
Weighted residual factors for significantly intense reflections | 0.1248 |
Weighted residual factors for all reflections included in the refinement | 0.1346 |
Goodness-of-fit parameter for all reflections included in the refinement | 1.022 |
Diffraction radiation wavelength | 0.71 Å |
Diffraction radiation type | MoKα |