Information card for entry 4349659
Formula | C43 H22 Cu F26 N2 O P3 |
Calculated formula | C43 H22 Cu F26 N2 O P3 |
SMILES | [Cu]12([P](c3c(F)c(F)c(F)c(F)c3F)(c3c(F)c(F)c(F)c(F)c3F)CC[P]1(c1c(F)c(F)c(F)c(F)c1F)c1c(F)c(F)c(F)c(F)c1F)[n]1ccc(c3ccc4c([n]2ccc4C)c13)C.[P](F)(F)(F)(F)(F)[F-].C(=O)(C)C |
Title of publication | Blue and orange oxygen responsive emissions in the solid state based on copper(i) complexes bearing dodecafluorinated diphosphine and 1,10-phenanthroline derivative ligands |
Authors of publication | Washimi, Masaya; Nishikawa, Michihiro; Shimoda, Naohiro; Satokawa, Shigeo; Tsubomura, Taro |
Journal of publication | Inorganic Chemistry Frontiers |
Year of publication | 2017 |
Journal volume | 4 |
Journal issue | 4 |
Pages of publication | 639 |
a | 12.522 ± 0.009 Å |
b | 18.331 ± 0.012 Å |
c | 20.77 ± 0.01 Å |
α | 90° |
β | 108.75 ± 0.04° |
γ | 90° |
Cell volume | 4515 ± 5 Å3 |
Cell temperature | 123 ± 2 K |
Ambient diffraction temperature | 123 K |
Number of distinct elements | 7 |
Space group number | 14 |
Hermann-Mauguin space group symbol | P 1 21/c 1 |
Hall space group symbol | -P 2ybc |
Residual factor for significantly intense reflections | 0.1016 |
Weighted residual factors for all reflections included in the refinement | 0.2582 |
Goodness-of-fit parameter for all reflections included in the refinement | 1.191 |
Diffraction radiation wavelength | 0.71073 Å |
Diffraction radiation type | MoKα |