Information card for entry 4349664
Formula | C28 H39 I N4 |
Calculated formula | C28 H39 I N4 |
SMILES | [I-].N(c1ccc(C(C)C)cc1)C(=N\c1ccc(cc1)C(C)C)\c1n(c(c([n+]1CC)C)C)CC |
Title of publication | Li2CdGeSe4and Li2CdSnSe4: biaxial nonlinear optical materials with strong infrared second-order responses and laser-induced damage thresholds influenced by photoluminescence |
Authors of publication | Zhang, Jian-Han; Clark, Daniel J.; Weiland, Ashley; Stoyko, Stanislav S.; Kim, Yong Soo; Jang, Joon I.; Aitken, Jennifer A. |
Journal of publication | Inorganic Chemistry Frontiers |
Year of publication | 2017 |
Journal volume | 4 |
Journal issue | 9 |
Pages of publication | 1472 |
a | 11.264 ± 0.005 Å |
b | 16.103 ± 0.008 Å |
c | 16.181 ± 0.01 Å |
α | 90° |
β | 110.13 ± 0.03° |
γ | 90° |
Cell volume | 2756 ± 3 Å3 |
Cell temperature | 296 ± 2 K |
Ambient diffraction temperature | 296.15 K |
Number of distinct elements | 4 |
Space group number | 14 |
Hermann-Mauguin space group symbol | P 1 21/n 1 |
Hall space group symbol | -P 2yn |
Residual factor for all reflections | 0.1602 |
Residual factor for significantly intense reflections | 0.0684 |
Weighted residual factors for significantly intense reflections | 0.14 |
Weighted residual factors for all reflections included in the refinement | 0.1811 |
Goodness-of-fit parameter for all reflections included in the refinement | 0.944 |
Diffraction radiation wavelength | 0.71073 Å |
Diffraction radiation type | MoKα |