Information card for entry 4349712
Formula | C24 H37 Cd6 O30.5 |
Calculated formula | C24 H24 Cd6 O30.5 |
Title of publication | Cadmium(ii) coordination polymers based on substituted malonic acid: synthesis, characterization and photoluminescence properties |
Authors of publication | Déniz, Mariadel; Pasán, Jorge; Rasines, Beatriz; Lorenzo-Luis, Pablo; Lahoz, Fernando; Vera-Gonzales, Corina; Julve, Miguel; Ruiz-Pérez, Catalina |
Journal of publication | Inorganic Chemistry Frontiers |
Year of publication | 2017 |
Journal volume | 4 |
Journal issue | 8 |
Pages of publication | 1384 |
a | 17.908 ± 0.002 Å |
b | 17.908 ± 0.002 Å |
c | 10.94 ± 0.0009 Å |
α | 90° |
β | 90° |
γ | 120° |
Cell volume | 3038.4 ± 0.5 Å3 |
Cell temperature | 293 ± 2 K |
Ambient diffraction temperature | 293 ± 2 K |
Number of distinct elements | 4 |
Space group number | 148 |
Hermann-Mauguin space group symbol | R -3 :H |
Hall space group symbol | -R 3 |
Residual factor for all reflections | 0.0382 |
Residual factor for significantly intense reflections | 0.036 |
Weighted residual factors for significantly intense reflections | 0.0729 |
Weighted residual factors for all reflections included in the refinement | 0.0735 |
Goodness-of-fit parameter for all reflections included in the refinement | 1.338 |
Diffraction radiation wavelength | 0.71073 Å |
Diffraction radiation type | MoKα |