Information card for entry 4349714
Formula | C5 H8 Cd O5 |
Calculated formula | C5 H8 Cd O5 |
Title of publication | Cadmium(ii) coordination polymers based on substituted malonic acid: synthesis, characterization and photoluminescence properties |
Authors of publication | Déniz, Mariadel; Pasán, Jorge; Rasines, Beatriz; Lorenzo-Luis, Pablo; Lahoz, Fernando; Vera-Gonzales, Corina; Julve, Miguel; Ruiz-Pérez, Catalina |
Journal of publication | Inorganic Chemistry Frontiers |
Year of publication | 2017 |
Journal volume | 4 |
Journal issue | 8 |
Pages of publication | 1384 |
a | 10.52 ± 0.002 Å |
b | 9.265 ± 0.0019 Å |
c | 7.896 ± 0.0016 Å |
α | 90° |
β | 104.74 ± 0.03° |
γ | 90° |
Cell volume | 744.3 ± 0.3 Å3 |
Cell temperature | 100 ± 2 K |
Ambient diffraction temperature | 100 ± 2 K |
Number of distinct elements | 4 |
Space group number | 14 |
Hermann-Mauguin space group symbol | P 1 21/c 1 |
Hall space group symbol | -P 2ybc |
Residual factor for all reflections | 0.0447 |
Residual factor for significantly intense reflections | 0.0444 |
Weighted residual factors for significantly intense reflections | 0.1239 |
Weighted residual factors for all reflections included in the refinement | 0.1243 |
Goodness-of-fit parameter for all reflections included in the refinement | 1.103 |
Diffraction radiation wavelength | 0.738 Å |